{"text_format":"1","workbook":"xlsx","n_sheets":2,"sheets":["messages","questions"],"not_rendered":{"charts":0,"images":0,"macros":1,"external_links":0,"defined_names":0,"comments":0,"pivot_tables":0},"unopened":[],"bounds":{"document_bytes":16777216,"sheet_cells":100000,"rows_first":2000,"rows_last":500,"rows_between":2000,"halvings":0,"cell_chars":16384,"cell_head_chars":4096},"cells_cut":0,"cells_raw":0,"read":"whole","date_system":"1900"}

{"sheet":"messages","index":0,"n_rows":8,"n_cols":3,"rows_kept":8,"cut":false,"hidden":false,"merged":[]}
[null,"score","message"]
[null,0,"Have you started?"]
[null,1,"Keep trying"]
[null,2,"Better"]
[null,3,"Doing well"]
[null,4,"Very good"]
[null,5,"Great"]
[null,6,"Brilliant"]

{"sheet":"questions","index":1,"n_rows":13,"n_cols":10,"rows_kept":13,"cut":false,"hidden":false,"merged":[]}
[]
[null,"Question","Answer","Message","Score",null,"Notes:"]
[null,"Capital of Thailand?",null,{"$f":"IF(C3=\"\",\"Fill in Answer\",IF(C3=\"bangkok\",\"Well done\",\"Try again\"))","v":"Fill in Answer"},{"$f":"IF(C3=\"\",\"Fill in Answer\",IF(C3=\"bangkok\",1,0))","v":"Fill in Answer"},null,"1) Cutomize the ribbon (right click on ribbon) and add the developer tab (right hand list)"]
[null,"4+4?",null,{"$f":"IF(C4=\"\",\"Fill in Answer\",IF(C4=8,\"Well done\",\"Try again\"))","v":"Fill in Answer"},{"$f":"IF(C4=\"\",\"Fill in Answer\",IF(C4=8,1,0))","v":"Fill in Answer"},null,"2) Record some macros to perform the actions you want; test them"]
[null,"Date of london Olympics?",null,{"$f":"IF(C5=\"\",\"Fill in Answer\",IF(C5=2012,\"Well done\",\"Try again\"))","v":"Fill in Answer"},{"$f":"IF(C5=\"\",\"Fill in Answer\",IF(C5=2012,1,0))","v":"Fill in Answer"},null,"3) Create buttons and add the macros to the buttons"]
[null,"Where is the mona lisa",null,{"$f":"IF(C6=\"\",\"Fill in Answer\",IF(C6=\"louvre\",\"Well done\",\"Try again\"))","v":"Fill in Answer"},{"$f":"IF(C6=\"\",\"Fill in Answer\",IF(C6=\"louvre\",1,0))","v":"Fill in Answer"},null,"4) Fix any problems - it is hard to get it right first time"]
[]
[null,null,null,null,null,null,"Reset macro actions:",null,null,"Submit macro actions:"]
[null,null,"Total",{"$f":"COUNTIF(D3:D7,\"Well done\")","v":0},{"$f":"SUM(E3:E7)","v":0},null,"Unprotect the sheet",null,null,"Unprotect the sheet"]
[null,{"$f":"VLOOKUP(D9,messages!B2:C8,2)","v":"Have you started?"},null,null,null,null,"Delete the answers",null,null,"Format the messages as purple"]
[null,null,null,null,null,null,"Format the messages as white",null,null,"Lock the answers"]
[null,null,null,null,null,null,"Unlock the answers",null,null,"Protect the sheet"]
[null,null,null,null,null,null,"Protect the sheet"]